{"text_format":"3","workbook":"xlsx","n_sheets":7,"sheets":["記入上の注意","総括申込表","男子個人種目","女子個人種目","リレー","所属コード","種目コード"],"not_rendered":{"defined_names":3,"comments":3},"read":"whole","date_system":"1900"}

{"sheet":"記入上の注意","index":0,"n_rows":99,"n_cols":11,"rows_kept":99}
["【申込みファイルの入力についての注意事項】"]
["①　例にならって入力してください。種目についてはリストから選んでください。"]
["②　番組編成に必要ですので、必ず申込記録を記入してください。"]
["③　県内団体コードはこのページの下部のものをお使いください。県外団体は各県のものをお使い下さい。"]
["④　棒高跳び用ポールの貸出しを行っています。必要な方は申込みください。県内選手は一人一日１００円、県外選手は一人一日３００円必要です。"]
["⑤　ポールの使用申込は、所定の欄に人数のみをご記入ください。"]
["⑥　入力がすみましたら、男女それぞれのページとリレー・総括表を印刷してください。"]
["⑦　総括表は、申込責任者の印を捺印したものを当日受付に参加料と併せてご提出下さい。"]
["⑧　申込ファイル名の後に校名や団体名を明記し　trk.m@takamatsu-tf.jpまで送信して下さい。"]
["【記入例】"]
["半角数字","全角漢字で\n姓と名の間は\n全角スペース","リストから","半角数字で（）に\n入力","半角カタカナで\n姓と名の間は\n半角スペース","リストから選ぶ\n種別に注意","トラック種目は7桁\nフィールド種目は5桁","リストから選ぶ\n種別に注意","トラック種目は7桁\nフィールド種目は5桁","リストから選ぶ\n種別に注意","トラック種目は7桁\nフィールド種目は5桁"]
["ﾅﾝﾊﾞｰｶｰﾄﾞ","氏名","所属","学年","ﾌﾘｶﾞﾅ","種目１","記録１","種目２","記録２","種目３","記録３"]
[1234,"高松　太朗","庵治中","2","ﾀｶﾏﾂ ﾀﾛｳ","１００ｍ","0001234","１５００ｍ","0023456","走幅跳","00634"]
[{"$nulls":6},"0時間00分12秒34",null,"0時間02分34秒56",null,"００６ｍ３４"]
[]
["入力について不明な点は、高松市陸協　事務局　増田人志（090-9773-2513） 　三谷昌輝（090-3780-1542）までお尋ね下さい。　"]
[]
["香川県"]
["高校所属コード",null,null,"中学所属コード",{"$nulls":3},"一般所属コード"]
[363091,"高松工業高専",null,365001,"土庄町立土庄中学校",null,null,360001,"三菱ケミカル"]
{"$rows_left_out":80}
{"sheet":"総括申込表","index":1,"n_rows":42,"n_cols":13,"rows_kept":42,"merged":[[3,2,3,3],[4,2,4,3],[4,8,4,9],[5,2,5,3],[5,8,5,9],[6,2,6,3],[36,3,36,8],[38,3,38,7],[41,1,41,2],[41,3,41,7]]}
["　　平成29年度",{"$nulls":7},"実施日"]
[null,null,"高松市長杯高松室内陸上競技大会　申込総括表",{"$nulls":9},"　"]
[]
[null,"ﾌﾘｶﾞﾅ",null,null,"←半角カタカナ8桁まで"]
[null,"所属略称",null,null,"←全角6桁まで",{"$nulls":3},"合計金額"]
[null,"所属コード",{"$f":"IF(C5=\"\",\"\",VLOOKUP(C5,所属コード!A1:D161,4))","v":""},null,"←半角数字6桁",{"$nulls":3},{"$f":"E12+J12+E17+J17+E22+J22+E27+J27+E31","v":0}]
[null,"県名",null,null,"←漢字"]
[]
[null,"香川県小学","個人種目数","リレー","参加料",null,"県外小学","個人種目数","リレー","参加料"]
[null,"男子",null,null,{"$f":"C10*200","v":0},null,"男子",null,null,{"$f":"H10*400","v":0}]
[null,"女子",null,null,{"$f":"C11*200","v":0},null,"女子",null,null,{"$f":"H11*400","v":0}]
[null,"計",{"$f":"SUM(C10:C11)","v":0},{"$f":"SUM(D10:D11)","v":0},{"$f":"SUM(E10:E11)","v":0},null,"計",{"$f":"SUM(H10:H11)","v":0},{"$f":"SUM(I10:I11)","v":0},{"$f":"SUM(J10:J11)","v":0}]
[]
[null,"香川県中学","個人種目数","リレー","参加料",null,"県外中学","個人種目数","リレー","参加料"]
[null,"男子",null,null,{"$f":"C15*400","v":0},null,"男子",null,null,{"$f":"H15*800","v":0}]
[null,"女子",null,null,{"$f":"C16*400","v":0},null,"女子",null,null,{"$f":"H16*800","v":0}]
[null,"計",{"$f":"SUM(C15:C16)","v":0},{"$f":"SUM(D15:D16)","v":0},{"$f":"SUM(E15:E16)","v":0},null,"計",{"$f":"SUM(H15:H16)","v":0},{"$f":"SUM(I15:I16)","v":0},{"$f":"SUM(J15:J16)","v":0}]
[]
[null,"香川県高校","個人種目数","リレー","参加料",null,"県外高校","個人種目数","リレー","参加料"]
[null,"男子",null,null,{"$f":"C20*500","v":0},null,"男子",null,null,{"$f":"H20*1000","v":0}]
{"$rows_left_out":23}
{"sheet":"男子個人種目","index":2,"n_rows":52,"n_cols":18,"rows_kept":52,"merged":[[0,13,0,17]]}
[null,"半角数字","全角漢字で\n姓と名の間は\n全角スペース","リストから選ぶ","半角数字で（）に\n入力","半角カタカナで\n姓と名の間は\n半角スペース","リストから選ぶ\n種別に注意","トラック種目は7桁\nフィールド種目は5桁","リストから選ぶ\n種別に注意","トラック種目は7桁\nフィールド種目は5桁","リストから選ぶ\n種別に注意","リストから選ぶ\n種別に注意","トラック種目は7桁\nフィールド種目は5桁","入力不要"]
[null,"ﾅﾝﾊﾞｰｶｰﾄﾞ","氏名","所属","学年","ﾌﾘｶﾞﾅ","種目１","記録１","種目２","記録２","種目３","種目３","記録３","性別コード","所属コード","種目１コード","種目２コード","種目３コード"]
[1,{"$nulls":12},{"$f":"IF(C3=\"\",\"\",1)","v":""},{"$f":"IF(D3=\"\",\"\",VLOOKUP(D3,所属コード!$C$1:$D$160,2,FALSE))","v":""},{"$f":"IF(G3=\"\",\"\",(VLOOKUP(G3,種目コード!$A$1:$B$35,2,FALSE)))","v":""},{"$f":"IF(I3=\"\",\"\",(VLOOKUP(I3,種目コード!$A$1:$B$35,2,FALSE)))","v":""},{"$f":"IF(L3=\"\",\"\",(VLOOKUP(L3,種目コード!$A$1:$B$35,2,FALSE)))","v":""}]
[2,{"$nulls":12},"",{"$f":"IF(D4=\"\",\"\",VLOOKUP(D4,所属コード!$C$1:$D$160,2,FALSE))","v":""},{"$f":"IFERROR(VLOOKUP(G4,種目コード!$A$1:$B$35,2,FALSE),\"\")","v":""},{"$f":"IF(I4=\"\",\"\",(VLOOKUP(I4,種目コード!$A$1:$B$35,2,FALSE)))","v":""},{"$f":"IF(L4=\"\",\"\",(VLOOKUP(L4,種目コード!$A$1:$B$35,2,FALSE)))","v":""}]
[3,{"$nulls":12},"",{"$f":"IF(D5=\"\",\"\",VLOOKUP(D5,所属コード!$C$1:$D$160,2,FALSE))","v":""},{"$f":"IFERROR(VLOOKUP(G5,種目コード!$A$1:$B$35,2,FALSE),\"\")","v":""},{"$f":"IF(I5=\"\",\"\",(VLOOKUP(I5,種目コード!$A$1:$B$35,2,FALSE)))","v":""},{"$f":"IF(L5=\"\",\"\",(VLOOKUP(L5,種目コード!$A$1:$B$35,2,FALSE)))","v":""}]
[4,{"$nulls":12},"",{"$f":"IF(D6=\"\",\"\",VLOOKUP(D6,所属コード!$C$1:$D$160,2,FALSE))","v":""},{"$f":"IFERROR(VLOOKUP(G6,種目コード!$A$1:$B$35,2,FALSE),\"\")","v":""},{"$f":"IF(I6=\"\",\"\",(VLOOKUP(I6,種目コード!$A$1:$B$35,2,FALSE)))","v":""},{"$f":"IF(L6=\"\",\"\",(VLOOKUP(L6,種目コード!$A$1:$B$35,2,FALSE)))","v":""}]
[5,{"$nulls":12},"",{"$f":"IF(D7=\"\",\"\",VLOOKUP(D7,所属コード!$C$1:$D$160,2,FALSE))","v":""},{"$f":"IFERROR(VLOOKUP(G7,種目コード!$A$1:$B$35,2,FALSE),\"\")","v":""},{"$f":"IF(I7=\"\",\"\",(VLOOKUP(I7,種目コード!$A$1:$B$35,2,FALSE)))","v":""},{"$f":"IF(L7=\"\",\"\",(VLOOKUP(L7,種目コード!$A$1:$B$35,2,FALSE)))","v":""}]
[6,{"$nulls":12},"",{"$f":"IF(D8=\"\",\"\",VLOOKUP(D8,所属コード!$C$1:$D$160,2,FALSE))","v":""},{"$f":"IFERROR(VLOOKUP(G8,種目コード!$A$1:$B$35,2,FALSE),\"\")","v":""},{"$f":"IF(I8=\"\",\"\",(VLOOKUP(I8,種目コード!$A$1:$B$35,2,FALSE)))","v":""},{"$f":"IF(L8=\"\",\"\",(VLOOKUP(L8,種目コード!$A$1:$B$35,2,FALSE)))","v":""}]
[7,{"$nulls":12},"",{"$f":"IF(D9=\"\",\"\",VLOOKUP(D9,所属コード!$C$1:$D$160,2,FALSE))","v":""},{"$f":"IFERROR(VLOOKUP(G9,種目コード!$A$1:$B$35,2,FALSE),\"\")","v":""},{"$f":"IF(I9=\"\",\"\",(VLOOKUP(I9,種目コード!$A$1:$B$35,2,FALSE)))","v":""},{"$f":"IF(L9=\"\",\"\",(VLOOKUP(L9,種目コード!$A$1:$B$35,2,FALSE)))","v":""}]
[8,{"$nulls":12},"",{"$f":"IF(D10=\"\",\"\",VLOOKUP(D10,所属コード!$C$1:$D$160,2,FALSE))","v":""},{"$f":"IFERROR(VLOOKUP(G10,種目コード!$A$1:$B$35,2,FALSE),\"\")","v":""},{"$f":"IF(I10=\"\",\"\",(VLOOKUP(I10,種目コード!$A$1:$B$35,2,FALSE)))","v":""},{"$f":"IF(L10=\"\",\"\",(VLOOKUP(L10,種目コード!$A$1:$B$35,2,FALSE)))","v":""}]
[9,{"$nulls":12},"",{"$f":"IF(D11=\"\",\"\",VLOOKUP(D11,所属コード!$C$1:$D$160,2,FALSE))","v":""},{"$f":"IFERROR(VLOOKUP(G11,種目コード!$A$1:$B$35,2,FALSE),\"\")","v":""},{"$f":"IF(I11=\"\",\"\",(VLOOKUP(I11,種目コード!$A$1:$B$35,2,FALSE)))","v":""},{"$f":"IF(L11=\"\",\"\",(VLOOKUP(L11,種目コード!$A$1:$B$35,2,FALSE)))","v":""}]
[10,{"$nulls":12},"",{"$f":"IF(D12=\"\",\"\",VLOOKUP(D12,所属コード!$C$1:$D$160,2,FALSE))","v":""},{"$f":"IFERROR(VLOOKUP(G12,種目コード!$A$1:$B$35,2,FALSE),\"\")","v":""},{"$f":"IF(I12=\"\",\"\",(VLOOKUP(I12,種目コード!$A$1:$B$35,2,FALSE)))","v":""},{"$f":"IF(L12=\"\",\"\",(VLOOKUP(L12,種目コード!$A$1:$B$35,2,FALSE)))","v":""}]
[11,{"$nulls":12},"",{"$f":"IF(D13=\"\",\"\",VLOOKUP(D13,所属コード!$C$1:$D$160,2,FALSE))","v":""},{"$f":"IFERROR(VLOOKUP(G13,種目コード!$A$1:$B$35,2,FALSE),\"\")","v":""},{"$f":"IF(I13=\"\",\"\",(VLOOKUP(I13,種目コード!$A$1:$B$35,2,FALSE)))","v":""},{"$f":"IF(L13=\"\",\"\",(VLOOKUP(L13,種目コード!$A$1:$B$35,2,FALSE)))","v":""}]
[12,{"$nulls":12},"",{"$f":"IF(D14=\"\",\"\",VLOOKUP(D14,所属コード!$C$1:$D$160,2,FALSE))","v":""},{"$f":"IFERROR(VLOOKUP(G14,種目コード!$A$1:$B$35,2,FALSE),\"\")","v":""},{"$f":"IF(I14=\"\",\"\",(VLOOKUP(I14,種目コード!$A$1:$B$35,2,FALSE)))","v":""},{"$f":"IF(L14=\"\",\"\",(VLOOKUP(L14,種目コード!$A$1:$B$35,2,FALSE)))","v":""}]
[13,{"$nulls":12},"",{"$f":"IF(D15=\"\",\"\",VLOOKUP(D15,所属コード!$C$1:$D$160,2,FALSE))","v":""},{"$f":"IFERROR(VLOOKUP(G15,種目コード!$A$1:$B$35,2,FALSE),\"\")","v":""},{"$f":"IF(I15=\"\",\"\",(VLOOKUP(I15,種目コード!$A$1:$B$35,2,FALSE)))","v":""},{"$f":"IF(L15=\"\",\"\",(VLOOKUP(L15,種目コード!$A$1:$B$35,2,FALSE)))","v":""}]
[14,{"$nulls":12},"",{"$f":"IF(D16=\"\",\"\",VLOOKUP(D16,所属コード!$C$1:$D$160,2,FALSE))","v":""},{"$f":"IFERROR(VLOOKUP(G16,種目コード!$A$1:$B$35,2,FALSE),\"\")","v":""},{"$f":"IF(I16=\"\",\"\",(VLOOKUP(I16,種目コード!$A$1:$B$35,2,FALSE)))","v":""},{"$f":"IF(L16=\"\",\"\",(VLOOKUP(L16,種目コード!$A$1:$B$35,2,FALSE)))","v":""}]
[15,{"$nulls":12},"",{"$f":"IF(D17=\"\",\"\",VLOOKUP(D17,所属コード!$C$1:$D$160,2,FALSE))","v":""},{"$f":"IFERROR(VLOOKUP(G17,種目コード!$A$1:$B$35,2,FALSE),\"\")","v":""},{"$f":"IF(I17=\"\",\"\",(VLOOKUP(I17,種目コード!$A$1:$B$35,2,FALSE)))","v":""},{"$f":"IF(L17=\"\",\"\",(VLOOKUP(L17,種目コード!$A$1:$B$35,2,FALSE)))","v":""}]
[16,{"$nulls":12},"",{"$f":"IF(D18=\"\",\"\",VLOOKUP(D18,所属コード!$C$1:$D$160,2,FALSE))","v":""},{"$f":"IFERROR(VLOOKUP(G18,種目コード!$A$1:$B$35,2,FALSE),\"\")","v":""},{"$f":"IF(I18=\"\",\"\",(VLOOKUP(I18,種目コード!$A$1:$B$35,2,FALSE)))","v":""},{"$f":"IF(L18=\"\",\"\",(VLOOKUP(L18,種目コード!$A$1:$B$35,2,FALSE)))","v":""}]
[17,{"$nulls":12},"",{"$f":"IF(D19=\"\",\"\",VLOOKUP(D19,所属コード!$C$1:$D$160,2,FALSE))","v":""},{"$f":"IFERROR(VLOOKUP(G19,種目コード!$A$1:$B$35,2,FALSE),\"\")","v":""},{"$f":"IF(I19=\"\",\"\",(VLOOKUP(I19,種目コード!$A$1:$B$35,2,FALSE)))","v":""},{"$f":"IF(L19=\"\",\"\",(VLOOKUP(L19,種目コード!$A$1:$B$35,2,FALSE)))","v":""}]
[18,{"$nulls":12},"",{"$f":"IF(D20=\"\",\"\",VLOOKUP(D20,所属コード!$C$1:$D$160,2,FALSE))","v":""},{"$f":"IFERROR(VLOOKUP(G20,種目コード!$A$1:$B$35,2,FALSE),\"\")","v":""},{"$f":"IF(I20=\"\",\"\",(VLOOKUP(I20,種目コード!$A$1:$B$35,2,FALSE)))","v":""},{"$f":"IF(L20=\"\",\"\",(VLOOKUP(L20,種目コード!$A$1:$B$35,2,FALSE)))","v":""}]
{"$rows_left_out":33}
{"sheet":"女子個人種目","index":3,"n_rows":52,"n_cols":18,"rows_kept":52,"merged":[[0,13,0,17]]}
[null,"半角数字","全角漢字で\n姓と名の間は\n全角スペース","リストから選ぶ","半角数字で（）に\n入力","半角カタカナで\n姓と名の間は\n半角スペース","リストから選ぶ\n種別に注意","トラック種目は7桁\nフィールド種目は5桁","リストから選ぶ\n種別に注意","トラック種目は7桁\nフィールド種目は5桁","リストから選ぶ\n種別に注意","リストから選ぶ\n種別に注意","トラック種目は7桁\nフィールド種目は5桁","入力不要"]
[null,"ﾅﾝﾊﾞｰｶｰﾄﾞ","氏名","所属","学年","ﾌﾘｶﾞﾅ","種目１","記録１","種目２","記録２","種目３","種目３","記録３","性別コード","所属コード","種目１コード","種目２コード","種目３コード"]
[1,{"$nulls":12},{"$f":"IF(C3=\"\",\"\",2)","v":""},{"$f":"IF(D3=\"\",\"\",VLOOKUP(D3,所属コード!$C$1:$D$160,2,FALSE))","v":""},{"$f":"IF(G3=\"\",\"\",(VLOOKUP(G3,種目コード!$A$1:$B$35,2,FALSE)))","v":""},{"$f":"IF(I3=\"\",\"\",(VLOOKUP(I3,種目コード!$A$1:$B$35,2,FALSE)))","v":""},{"$f":"IF(L3=\"\",\"\",(VLOOKUP(L3,種目コード!$A$1:$B$35,2,FALSE)))","v":""}]
[2,{"$nulls":12},{"$f":"IF(C4=\"\",\"\",2)","v":""},{"$f":"IF(D4=\"\",\"\",VLOOKUP(D4,所属コード!$C$1:$D$160,2,FALSE))","v":""},{"$f":"IFERROR(VLOOKUP(G4,種目コード!$A$1:$B$35,2,FALSE),\"\")","v":""},{"$f":"IF(I4=\"\",\"\",(VLOOKUP(I4,種目コード!$A$1:$B$35,2,FALSE)))","v":""},{"$f":"IF(L4=\"\",\"\",(VLOOKUP(L4,種目コード!$A$1:$B$35,2,FALSE)))","v":""}]
[3,{"$nulls":12},"",{"$f":"IF(D5=\"\",\"\",VLOOKUP(D5,所属コード!$C$1:$D$160,2,FALSE))","v":""},{"$f":"IFERROR(VLOOKUP(G5,種目コード!$A$1:$B$35,2,FALSE),\"\")","v":""},{"$f":"IF(I5=\"\",\"\",(VLOOKUP(I5,種目コード!$A$1:$B$35,2,FALSE)))","v":""},{"$f":"IF(L5=\"\",\"\",(VLOOKUP(L5,種目コード!$A$1:$B$35,2,FALSE)))","v":""}]
[4,{"$nulls":12},"",{"$f":"IF(D6=\"\",\"\",VLOOKUP(D6,所属コード!$C$1:$D$160,2,FALSE))","v":""},{"$f":"IFERROR(VLOOKUP(G6,種目コード!$A$1:$B$35,2,FALSE),\"\")","v":""},{"$f":"IF(I6=\"\",\"\",(VLOOKUP(I6,種目コード!$A$1:$B$35,2,FALSE)))","v":""},{"$f":"IF(L6=\"\",\"\",(VLOOKUP(L6,種目コード!$A$1:$B$35,2,FALSE)))","v":""}]
[5,{"$nulls":12},"",{"$f":"IF(D7=\"\",\"\",VLOOKUP(D7,所属コード!$C$1:$D$160,2,FALSE))","v":""},{"$f":"IFERROR(VLOOKUP(G7,種目コード!$A$1:$B$35,2,FALSE),\"\")","v":""},{"$f":"IF(I7=\"\",\"\",(VLOOKUP(I7,種目コード!$A$1:$B$35,2,FALSE)))","v":""},{"$f":"IF(L7=\"\",\"\",(VLOOKUP(L7,種目コード!$A$1:$B$35,2,FALSE)))","v":""}]
[6,{"$nulls":12},"",{"$f":"IF(D8=\"\",\"\",VLOOKUP(D8,所属コード!$C$1:$D$160,2,FALSE))","v":""},{"$f":"IFERROR(VLOOKUP(G8,種目コード!$A$1:$B$35,2,FALSE),\"\")","v":""},{"$f":"IF(I8=\"\",\"\",(VLOOKUP(I8,種目コード!$A$1:$B$35,2,FALSE)))","v":""},{"$f":"IF(L8=\"\",\"\",(VLOOKUP(L8,種目コード!$A$1:$B$35,2,FALSE)))","v":""}]
[7,{"$nulls":12},"",{"$f":"IF(D9=\"\",\"\",VLOOKUP(D9,所属コード!$C$1:$D$160,2,FALSE))","v":""},{"$f":"IFERROR(VLOOKUP(G9,種目コード!$A$1:$B$35,2,FALSE),\"\")","v":""},{"$f":"IF(I9=\"\",\"\",(VLOOKUP(I9,種目コード!$A$1:$B$35,2,FALSE)))","v":""},{"$f":"IF(L9=\"\",\"\",(VLOOKUP(L9,種目コード!$A$1:$B$35,2,FALSE)))","v":""}]
[8,{"$nulls":12},"",{"$f":"IF(D10=\"\",\"\",VLOOKUP(D10,所属コード!$C$1:$D$160,2,FALSE))","v":""},{"$f":"IFERROR(VLOOKUP(G10,種目コード!$A$1:$B$35,2,FALSE),\"\")","v":""},{"$f":"IF(I10=\"\",\"\",(VLOOKUP(I10,種目コード!$A$1:$B$35,2,FALSE)))","v":""},{"$f":"IF(L10=\"\",\"\",(VLOOKUP(L10,種目コード!$A$1:$B$35,2,FALSE)))","v":""}]
[9,{"$nulls":12},"",{"$f":"IF(D11=\"\",\"\",VLOOKUP(D11,所属コード!$C$1:$D$160,2,FALSE))","v":""},{"$f":"IFERROR(VLOOKUP(G11,種目コード!$A$1:$B$35,2,FALSE),\"\")","v":""},{"$f":"IF(I11=\"\",\"\",(VLOOKUP(I11,種目コード!$A$1:$B$35,2,FALSE)))","v":""},{"$f":"IF(L11=\"\",\"\",(VLOOKUP(L11,種目コード!$A$1:$B$35,2,FALSE)))","v":""}]
[10,{"$nulls":12},"",{"$f":"IF(D12=\"\",\"\",VLOOKUP(D12,所属コード!$C$1:$D$160,2,FALSE))","v":""},{"$f":"IFERROR(VLOOKUP(G12,種目コード!$A$1:$B$35,2,FALSE),\"\")","v":""},{"$f":"IF(I12=\"\",\"\",(VLOOKUP(I12,種目コード!$A$1:$B$35,2,FALSE)))","v":""},{"$f":"IF(L12=\"\",\"\",(VLOOKUP(L12,種目コード!$A$1:$B$35,2,FALSE)))","v":""}]
[11,{"$nulls":12},"",{"$f":"IF(D13=\"\",\"\",VLOOKUP(D13,所属コード!$C$1:$D$160,2,FALSE))","v":""},{"$f":"IFERROR(VLOOKUP(G13,種目コード!$A$1:$B$35,2,FALSE),\"\")","v":""},{"$f":"IF(I13=\"\",\"\",(VLOOKUP(I13,種目コード!$A$1:$B$35,2,FALSE)))","v":""},{"$f":"IF(L13=\"\",\"\",(VLOOKUP(L13,種目コード!$A$1:$B$35,2,FALSE)))","v":""}]
[12,{"$nulls":12},"",{"$f":"IF(D14=\"\",\"\",VLOOKUP(D14,所属コード!$C$1:$D$160,2,FALSE))","v":""},{"$f":"IFERROR(VLOOKUP(G14,種目コード!$A$1:$B$35,2,FALSE),\"\")","v":""},{"$f":"IF(I14=\"\",\"\",(VLOOKUP(I14,種目コード!$A$1:$B$35,2,FALSE)))","v":""},{"$f":"IF(L14=\"\",\"\",(VLOOKUP(L14,種目コード!$A$1:$B$35,2,FALSE)))","v":""}]
[13,{"$nulls":12},"",{"$f":"IF(D15=\"\",\"\",VLOOKUP(D15,所属コード!$C$1:$D$160,2,FALSE))","v":""},{"$f":"IFERROR(VLOOKUP(G15,種目コード!$A$1:$B$35,2,FALSE),\"\")","v":""},{"$f":"IF(I15=\"\",\"\",(VLOOKUP(I15,種目コード!$A$1:$B$35,2,FALSE)))","v":""},{"$f":"IF(L15=\"\",\"\",(VLOOKUP(L15,種目コード!$A$1:$B$35,2,FALSE)))","v":""}]
[14,{"$nulls":12},"",{"$f":"IF(D16=\"\",\"\",VLOOKUP(D16,所属コード!$C$1:$D$160,2,FALSE))","v":""},{"$f":"IFERROR(VLOOKUP(G16,種目コード!$A$1:$B$35,2,FALSE),\"\")","v":""},{"$f":"IF(I16=\"\",\"\",(VLOOKUP(I16,種目コード!$A$1:$B$35,2,FALSE)))","v":""},{"$f":"IF(L16=\"\",\"\",(VLOOKUP(L16,種目コード!$A$1:$B$35,2,FALSE)))","v":""}]
[15,{"$nulls":12},"",{"$f":"IF(D17=\"\",\"\",VLOOKUP(D17,所属コード!$C$1:$D$160,2,FALSE))","v":""},{"$f":"IFERROR(VLOOKUP(G17,種目コード!$A$1:$B$35,2,FALSE),\"\")","v":""},{"$f":"IF(I17=\"\",\"\",(VLOOKUP(I17,種目コード!$A$1:$B$35,2,FALSE)))","v":""},{"$f":"IF(L17=\"\",\"\",(VLOOKUP(L17,種目コード!$A$1:$B$35,2,FALSE)))","v":""}]
[16,{"$nulls":12},"",{"$f":"IF(D18=\"\",\"\",VLOOKUP(D18,所属コード!$C$1:$D$160,2,FALSE))","v":""},{"$f":"IFERROR(VLOOKUP(G18,種目コード!$A$1:$B$35,2,FALSE),\"\")","v":""},{"$f":"IF(I18=\"\",\"\",(VLOOKUP(I18,種目コード!$A$1:$B$35,2,FALSE)))","v":""},{"$f":"IF(L18=\"\",\"\",(VLOOKUP(L18,種目コード!$A$1:$B$35,2,FALSE)))","v":""}]
[17,{"$nulls":12},"",{"$f":"IF(D19=\"\",\"\",VLOOKUP(D19,所属コード!$C$1:$D$160,2,FALSE))","v":""},{"$f":"IFERROR(VLOOKUP(G19,種目コード!$A$1:$B$35,2,FALSE),\"\")","v":""},{"$f":"IF(I19=\"\",\"\",(VLOOKUP(I19,種目コード!$A$1:$B$35,2,FALSE)))","v":""},{"$f":"IF(L19=\"\",\"\",(VLOOKUP(L19,種目コード!$A$1:$B$35,2,FALSE)))","v":""}]
[18,{"$nulls":12},"",{"$f":"IF(D20=\"\",\"\",VLOOKUP(D20,所属コード!$C$1:$D$160,2,FALSE))","v":""},{"$f":"IFERROR(VLOOKUP(G20,種目コード!$A$1:$B$35,2,FALSE),\"\")","v":""},{"$f":"IF(I20=\"\",\"\",(VLOOKUP(I20,種目コード!$A$1:$B$35,2,FALSE)))","v":""},{"$f":"IF(L20=\"\",\"\",(VLOOKUP(L20,種目コード!$A$1:$B$35,2,FALSE)))","v":""}]
{"$rows_left_out":33}
{"sheet":"リレー","index":4,"n_rows":54,"n_cols":12,"rows_kept":54}
["リレー申し込み"]
["リスト選択","略称ﾖﾐｶﾞﾅ","略称","所属コード","選択","記録は5桁","例５６秒３０\n05630","選手はナンバーを記入、半角数字"]
["種目","略称校名","略称ﾖﾐｶﾞﾅ","チームコード","A・B","記録","選手１","選手２","選手３","選手４","選手５","選手６"]
[{"$nulls":3},{"$f":"IF(B4=\"\",\"\",VLOOKUP(B4,所属コード!$C$1:$D$160,2))","v":""}]
[{"$nulls":3},{"$f":"IF(B5=\"\",\"\",VLOOKUP(B5,所属コード!$C$1:$D$160,2))","v":""}]
[{"$nulls":3},{"$f":"IF(B6=\"\",\"\",VLOOKUP(B6,所属コード!$C$1:$D$160,2))","v":""}]
[{"$nulls":3},{"$f":"IF(B7=\"\",\"\",VLOOKUP(B7,所属コード!$C$1:$D$160,2))","v":""}]
[{"$nulls":3},{"$f":"IF(B8=\"\",\"\",VLOOKUP(B8,所属コード!$C$1:$D$160,2))","v":""}]
[{"$nulls":3},{"$f":"IF(B9=\"\",\"\",VLOOKUP(B9,所属コード!$C$1:$D$160,2))","v":""}]
[{"$nulls":3},{"$f":"IF(B10=\"\",\"\",VLOOKUP(B10,所属コード!$C$1:$D$160,2))","v":""}]
[{"$nulls":3},{"$f":"IF(B11=\"\",\"\",VLOOKUP(B11,所属コード!$C$1:$D$160,2))","v":""}]
[{"$nulls":3},{"$f":"IF(B12=\"\",\"\",VLOOKUP(B12,所属コード!$C$1:$D$160,2))","v":""}]
[{"$nulls":3},{"$f":"IF(B13=\"\",\"\",VLOOKUP(B13,所属コード!$C$1:$D$160,2))","v":""}]
[{"$nulls":3},{"$f":"IF(B14=\"\",\"\",VLOOKUP(B14,所属コード!$C$1:$D$160,2))","v":""}]
[{"$nulls":3},{"$f":"IF(B15=\"\",\"\",VLOOKUP(B15,所属コード!$C$1:$D$160,2))","v":""}]
[{"$nulls":3},{"$f":"IF(B16=\"\",\"\",VLOOKUP(B16,所属コード!$C$1:$D$160,2))","v":""}]
[{"$nulls":3},{"$f":"IF(B17=\"\",\"\",VLOOKUP(B17,所属コード!$C$1:$D$160,2))","v":""}]
[{"$nulls":3},{"$f":"IF(B18=\"\",\"\",VLOOKUP(B18,所属コード!$C$1:$D$160,2))","v":""}]
[{"$nulls":3},{"$f":"IF(B19=\"\",\"\",VLOOKUP(B19,所属コード!$C$1:$D$160,2))","v":""}]
[{"$nulls":3},{"$f":"IF(B20=\"\",\"\",VLOOKUP(B20,所属コード!$C$1:$D$160,2))","v":""}]
{"$rows_left_out":10}
{"sheet":"所属コード","index":5,"n_rows":160,"n_cols":4,"rows_kept":160,"hidden":true}
["№","区分","所属名","コード"]
[1,"中学","土庄中",365001]
[2,"中学","豊島中",365002]
[3,"中学","内海中",365003]
[4,"中学","池田中",365004]
[5,"中学","引田中",365005]
[6,"中学","白鳥中",365006]
[7,"中学","大川中",365007]
[8,"中学","さぬき南",365008]
[9,"中学","大川第一中",365009]
[10,"中学","志度中",365010]
[11,"中学","志度東中",365011]
[12,"中学","天王中",365012]
[13,"中学","長尾中",365013]
[14,"中学","三木中",365014]
[15,"中学","直島中",365015]
[16,"中学","附属高松中",365016]
[17,"中学","高松北中",365017]
[18,"中学","桜町中",365018]
[19,"中学","紫雲中",365019]
{"$rows_left_out":141}
{"sheet":"種目コード","index":6,"n_rows":35,"n_cols":2,"rows_kept":35,"hidden":true}
["正式種目名","CODE"]
["６０ｍ",{"v":1,"d":"001"}]
["１００ｍ",{"v":2,"d":"002"}]
["２００ｍ",{"v":3,"d":"003"}]
["４００ｍ",{"v":5,"d":"005"}]
["８００ｍ",{"v":6,"d":"006"}]
["１５００ｍ",{"v":8,"d":"008"}]
["３０００ｍ",{"v":10,"d":"010"}]
["５０００ｍ",{"v":11,"d":"011"}]
["男中１１０ｍＨ(0.914m)",{"v":32,"d":"032"}]
["男１１０ｍＨ(1.067m)",{"v":34,"d":"034"}]
["男４００ｍＨ(0.914m)",{"v":37,"d":"037"}]
["女中１００ｍＨ(0.762m)",{"v":42,"d":"042"}]
["女１００ｍＨ(0.838m)",{"v":44,"d":"044"}]
["女４００ｍＨ(0.762m)",{"v":46,"d":"046"}]
["３０００ｍ障害(762mm)",{"v":54,"d":"054"}]
["５０００ｍ競歩",{"v":61,"d":"061"}]
["走高跳",{"v":71,"d":"071"}]
["棒高跳",{"v":72,"d":"072"}]
["走幅跳",{"v":73,"d":"073"}]
{"$rows_left_out":15}